BDBM42514 5-(butylcarbamoyl)-3-[(2-fluorophenyl)sulfanylmethyl]-1,2-oxazole-4-carboxylic acid::5-(butylcarbamoyl)-3-[[(2-fluorophenyl)thio]methyl]isoxazole-4-carboxylic acid::5-[butylamino(oxo)methyl]-3-[[(2-fluorophenyl)thio]methyl]-4-isoxazolecarboxylic acid::MLS000560752::SMR000155767::cid_11958626
SMILES CCCCNC(=O)c1onc(CSc2ccccc2F)c1C(O)=O
InChI Key InChIKey=GVMMLMRNMLNYSB-UHFFFAOYSA-N
Data  1 IC50
  Tab Delimited (TSV)   2D SDfile   Computed 3D by Vconf -m prep SDfile
Find this compound or compounds like it in BindingDB:
Activity Spreadsheet -- Enzyme Inhibition Constant Data from BindingDB
Found 1 hit for monomerid = 42514
TargetNeuropeptide Y receptor type 1(Homo sapiens (Human))
The Scripps Research Institute Molecular Screening Center
Curated by PubChem BioAssay
LigandPNGBDBM42514(5-(butylcarbamoyl)-3-[(2-fluorophenyl)sulfanylmeth...)
Affinity DataIC50:  1.47E+4nM. Assay description: Source (MLSCN Center Name): The Scripps Research Institute Molecular Screening Center Affiliation: The Scripps Research Institute, TSRI Assay Provide...
In DepthDetails PCBioAssay