BDBM42534 1-[amino-[(4,6-dimethyl-2-quinazolinyl)amino]methylidene]-3-(2,4-dimethylphenyl)thiourea::1-[amino-[(4,6-dimethylquinazolin-2-yl)amino]methylene]-3-(2,4-dimethylphenyl)thiourea::1-[amino-[(4,6-dimethylquinazolin-2-yl)amino]methylidene]-3-(2,4-dimethylphenyl)thiourea::1-[azanyl-[(4,6-dimethylquinazolin-2-yl)amino]methylidene]-3-(2,4-dimethylphenyl)thiourea::MLS000331513::SMR000220985::cid_1618379
SMILES Cc1ccc(NC(=S)NC(N)=Nc2nc(C)c3cc(C)ccc3n2)c(C)c1
InChI Key InChIKey=JAOIBLJSBWGXSB-UHFFFAOYSA-N
Data  3 IC50
  Tab Delimited (TSV)   2D SDfile   Computed 3D by Vconf -m prep SDfile
Find this compound or compounds like it in BindingDB:
Activity Spreadsheet -- Enzyme Inhibition Constant Data from BindingDB
Found 3 hits for monomerid = 42534
TargetNeuropeptide Y receptor type 1(Homo sapiens (Human))
The Scripps Research Institute Molecular Screening Center
Curated by PubChem BioAssay
LigandPNGBDBM42534(1-[amino-[(4,6-dimethyl-2-quinazolinyl)amino]methy...)
Affinity DataIC50: >3.50E+4nM. Assay description: Source (MLSCN Center Name): The Scripps Research Institute Molecular Screening Center Affiliation: The Scripps Research Institute, TSRI Assay Provide...
In DepthDetails PCBioAssay
TargetMitochondrial import inner membrane translocase subunit TIM23(Saccharomyces cerevisiae S288c)
Burnham Center For Chemical Genomics
Curated by PubChem BioAssay
LigandPNGBDBM42534(1-[amino-[(4,6-dimethyl-2-quinazolinyl)amino]methy...)
Affinity DataIC50:  1.70E+4nM. Assay description: Data Source: Sanford-Burnham Center for Chemical Genomics (SBCCG) Source Affiliation: Sanford-Burnham Medical Research Institute(SBMRI, San Diego, CA...
In DepthDetails PCBioAssay
TargetMitochondrial import inner membrane translocase subunit TIM10(Saccharomyces cerevisiae S288c)
Burnham Center For Chemical Genomics
Curated by PubChem BioAssay
LigandPNGBDBM42534(1-[amino-[(4,6-dimethyl-2-quinazolinyl)amino]methy...)
Affinity DataIC50:  1.27E+4nM. Assay description: Data Source: Sanford-Burnham Center for Chemical Genomics (SBCCG) Source Affiliation: Sanford-Burnham Medical Research Institute(SBMRI, San Diego, CA...
In DepthDetails PCBioAssay