BDBM42554 1-[(2-chlorobenzylidene)amino]-3-phenethyl-thiourea::1-[(2-chlorophenyl)methylideneamino]-3-(2-phenylethyl)thiourea::MLS000722980::SMR000236415::cid_2725318
SMILES Clc1ccccc1C=NNC(=S)NCCc1ccccc1
InChI Key InChIKey=QUKYFVRLDWWACA-UHFFFAOYSA-N
Data  1 IC50
  Tab Delimited (TSV)   2D SDfile   Computed 3D by Vconf -m prep SDfile
Find this compound or compounds like it in BindingDB:
Activity Spreadsheet -- Enzyme Inhibition Constant Data from BindingDB
Found 1 hit for monomerid = 42554
TargetNeuropeptide Y receptor type 1(Homo sapiens (Human))
The Scripps Research Institute Molecular Screening Center
Curated by PubChem BioAssay
LigandPNGBDBM42554(1-[(2-chlorobenzylidene)amino]-3-phenethyl-thioure...)
Affinity DataIC50:  5.02E+3nM. Assay description: Source (MLSCN Center Name): The Scripps Research Institute Molecular Screening Center Affiliation: The Scripps Research Institute, TSRI Assay Provide...
In DepthDetails PCBioAssay