BDBM42570 4-keto-N-(4-methoxy-3-piperidinosulfonyl-phenyl)-3H-phthalazine-1-carboxamide::MLS000393980::N-(4-methoxy-3-piperidin-1-ylsulfonyl-phenyl)-4-oxidanylidene-3H-phthalazine-1-carboxamide::N-(4-methoxy-3-piperidin-1-ylsulfonylphenyl)-4-oxo-3H-phthalazine-1-carboxamide::N-[4-methoxy-3-(1-piperidinylsulfonyl)phenyl]-4-oxo-3H-phthalazine-1-carboxamide::SMR000241569::cid_4876785
SMILES COc1ccc(NC(=O)c2n[nH]c(=O)c3ccccc23)cc1S(=O)(=O)N1CCCCC1
InChI Key InChIKey=CZXWEKRTGAVHJO-UHFFFAOYSA-N
Data  1 IC50
  Tab Delimited (TSV)   2D SDfile   Computed 3D by Vconf -m prep SDfile
Find this compound or compounds like it in BindingDB:
Activity Spreadsheet -- Enzyme Inhibition Constant Data from BindingDB
Found 1 hit for monomerid = 42570
TargetNeuropeptide Y receptor type 1(Homo sapiens (Human))
The Scripps Research Institute Molecular Screening Center
Curated by PubChem BioAssay
LigandPNGBDBM42570(4-keto-N-(4-methoxy-3-piperidinosulfonyl-phenyl)-3...)
Affinity DataIC50:  2.10E+4nM. Assay description: Source (MLSCN Center Name): The Scripps Research Institute Molecular Screening Center Affiliation: The Scripps Research Institute, TSRI Assay Provide...
In DepthDetails PCBioAssay