BDBM42571 MLS000702751::N,N-dimethyl-1-(2-naphthalen-1-ylsulfanylphenyl)methanamine;hydrochloride::N,N-dimethyl-1-[2-(1-naphthalenylthio)phenyl]methanamine;hydrochloride::N,N-dimethyl-N-[2-(1-naphthylsulfanyl)benzyl]amine::SMR000224866::cid_15945571::dimethyl-[2-(1-naphthylthio)benzyl]amine;hydrochloride
SMILES CN(C)Cc1ccccc1Sc1cccc2ccccc12
InChI Key InChIKey=DGZUNQTZDDPLAE-UHFFFAOYSA-N
Data  1 IC50
  Tab Delimited (TSV)   2D SDfile   Computed 3D by Vconf -m prep SDfile
Find this compound or compounds like it in BindingDB:
Activity Spreadsheet -- Enzyme Inhibition Constant Data from BindingDB
Found 1 hit for monomerid = 42571
TargetNeuropeptide Y receptor type 1(Homo sapiens (Human))
The Scripps Research Institute Molecular Screening Center
Curated by PubChem BioAssay
LigandPNGBDBM42571(MLS000702751 | N,N-dimethyl-1-(2-naphthalen-1-ylsu...)
Affinity DataIC50:  6.03E+3nM. Assay description: Source (MLSCN Center Name): The Scripps Research Institute Molecular Screening Center Affiliation: The Scripps Research Institute, TSRI Assay Provide...
In DepthDetails PCBioAssay