BDBM42854 MLS000101370::N-[1-(1-ethyl-2-benzimidazolyl)ethyl]acetamide::N-[1-(1-ethylbenzimidazol-2-yl)ethyl]acetamide::N-[1-(1-ethylbenzimidazol-2-yl)ethyl]ethanamide::SMR000016065::cid_2975259
SMILES CCn1c(nc2ccccc12)C(C)NC(C)=O
InChI Key InChIKey=QXCMDFKDUFYDJH-UHFFFAOYSA-N
Data  2 IC50
  Tab Delimited (TSV)   2D SDfile   Computed 3D by Vconf -m prep SDfile
Find this compound or compounds like it in BindingDB:
Activity Spreadsheet -- Enzyme Inhibition Constant Data from BindingDB
Found 2 hits for monomerid = 42854
TargetKallikrein-5(Homo sapiens (Human))
Pcmd
Curated by PubChem BioAssay
LigandPNGBDBM42854(MLS000101370 | N-[1-(1-ethyl-2-benzimidazolyl)ethy...)
Affinity DataIC50:  5.00E+4nM. Assay description: Molecular Library Screening Center Network (MLSCN) Penn Center for Molecular Discovery (PCMD) Assay Provider: Scott L. Diamond, University of Pennsy...
In DepthDetails PCBioAssay
TargetMitogen-activated protein kinase 10(Homo sapiens (Human))
The Scripps Research Institute Molecular Screening Center
Curated by PubChem BioAssay
LigandPNGBDBM42854(MLS000101370 | N-[1-(1-ethyl-2-benzimidazolyl)ethy...)
Affinity DataIC50: >9.31E+4nM. Assay description: Source (MLSCN Center Name): The Scripps Research Institute Molecular Screening Center Affiliation: The Scripps Research Institute, TSRI Assay Provide...
In DepthDetails PCBioAssay