BDBM428987 jm5b01461, Compound 22
SMILES CC(C)C[C@H](NC(=O)C(NC(=O)[C@@H](NC(C)=O)C(C)C)C(C)O)C(=O)N[C@@H](CCC(=O)N(C)C)C(=O)Cn1[nH]c(=O)c2c(cccc2c1=O)[N+]([O-])=O
InChI Key InChIKey=AAKLLOMUJFZNEN-MDRPYSOZSA-N
Data  1 IC50
  Tab Delimited (TSV)   2D SDfile   Computed 3D by Vconf -m prep SDfile
Find this compound or compounds like it in BindingDB:
Activity Spreadsheet -- Enzyme Inhibition Constant Data from BindingDB
Found 1 hit for monomerid = 428987
TargetReplicase polyprotein 1ab(Human SARS coronavirus (SARS-CoV) (Severe acute re...)
University Of Bonn
LigandPNGBDBM428987(jm5b01461, Compound 22)
Affinity DataIC50:  5.30E+4nM. Assay description: This is a review article.
Ligand InfoPC cidPC sid
In DepthDetails ArticlePubMed