BDBM429084 jm5b01461, Compound 34
SMILES CN(C)c1ccc(cc1)C(=O)N[C@@H](Cc1ccccc1)C(=O)Nc1ccccc1
InChI Key InChIKey=GPSHAEBYJLCMDC-QFIPXVFZSA-N
Data  1 IC50
  Tab Delimited (TSV)   2D SDfile   Computed 3D by Vconf -m prep SDfile
Find this compound or compounds like it in BindingDB:
Activity Spreadsheet -- Enzyme Inhibition Constant Data from BindingDB
Found 1 hit for monomerid = 429084
TargetReplicase polyprotein 1ab(Human SARS coronavirus (SARS-CoV) (Severe acute re...)
University Of Bonn
LigandPNGBDBM429084(jm5b01461, Compound 34)
Affinity DataIC50: >1.00E+4nM. Assay description: This is a review article.
In DepthDetails ArticlePubMed