BDBM429240 med.21724, Compound 12
SMILES CC(C)CC(CC(=O)NO)C(=O)NC(C(=O)NC(C)C(=O)NCCN)C(C)(C)C
InChI Key InChIKey=LMIQCBIEAHJAMZ-UHFFFAOYSA-N
Data  1 IC50
PDB links: 9 PDB IDs match this monomer.
  Tab Delimited (TSV)   2D SDfile   Computed 3D by Vconf -m prep SDfile
Find this compound or compounds like it in BindingDB:
Activity Spreadsheet -- Enzyme Inhibition Constant Data from BindingDB
Found 1 hit for monomerid = 429240
TargetAngiotensin-converting enzyme 2(Homo sapiens (Human))
University Of Bonn
LigandPNGBDBM429240(med.21724, Compound 12)
Affinity DataIC50:  200nM. Assay description: This is a review article.
In DepthDetails ArticlePubMed