BDBM429243 jm5b01461, Compound 60
SMILES CC(C)C[C@H](NC(=O)[C@@H](NC(=O)OCc1cccc(c1)N(C)C)C(C)C)C(=O)N[C@@H](C[C@@H]1CCNC1=O)C(=O)c1nc2ccccc2s1
InChI Key InChIKey=GWBXIKYLRCLTAU-SINPBGNNSA-N
Data  2 KI
  Tab Delimited (TSV)   2D SDfile   Computed 3D by Vconf -m prep SDfile
Find this compound or compounds like it in BindingDB:
Activity Spreadsheet -- Enzyme Inhibition Constant Data from BindingDB
Found 2 hits for monomerid = 429243
TargetReplicase polyprotein 1ab(Human SARS coronavirus (SARS-CoV) (Severe acute re...)
University Of Bonn
LigandPNGBDBM429243(jm5b01461, Compound 60)
Affinity DataKi:  3nM. Assay description: This is a review article.
Ligand InfoPC cidPC sid
In DepthDetails ArticlePubMed
TargetReplicase polyprotein 1ab(Human SARS coronavirus (SARS-CoV) (Severe acute re...)
University Of Bonn
LigandPNGBDBM429243(jm5b01461, Compound 60)
Affinity DataKi:  3.10nM. Assay description: This is a review article.
Ligand InfoPC cidPC sid
In DepthDetails ArticlePubMed