BDBM429269 jm5b01461, Compound 87
SMILES COc1ccc(cc1-c1c(O)cc(O)c2c1oc(cc2=O)-c1ccc(O)cc1)-c1oc2cc(O)cc(O)c2c(=O)c1O
InChI Key InChIKey=HAOSUSJBFCRFET-UHFFFAOYSA-N
Data  1 IC50
  Tab Delimited (TSV)   2D SDfile   Computed 3D by Vconf -m prep SDfile
Find this compound or compounds like it in BindingDB:
Activity Spreadsheet -- Enzyme Inhibition Constant Data from BindingDB
Found 1 hit for monomerid = 429269
TargetReplicase polyprotein 1ab(Human SARS coronavirus (SARS-CoV) (Severe acute re...)
University Of Bonn
LigandPNGBDBM429269(jm5b01461, Compound 87)
Affinity DataIC50:  7.23E+4nM. Assay description: This is a review article.
Ligand InfoPC cidPC sid
In DepthDetails ArticlePubMed