BDBM429270 acs.jmedchem.1c00409_ST.668::jm5b01461, Compound 88
SMILES COc1ccc(cc1)-c1cc(=O)c2c(O)cc(O)c(-c3cc(ccc3OC)-c3cc(=O)c4c(O)cc(OC)cc4o3)c2o1
InChI Key InChIKey=YCXRBCHEOFVYEN-UHFFFAOYSA-N
Data  1 KI  2 IC50
  Tab Delimited (TSV)   2D SDfile   Computed 3D by Vconf -m prep SDfile
Find this compound or compounds like it in BindingDB:
Activity Spreadsheet -- Enzyme Inhibition Constant Data from BindingDB
Found 3 hits for monomerid = 429270
TargetReplicase polyprotein 1ab(Human SARS coronavirus (SARS-CoV) (Severe acute re...)
Michigan State University
LigandPNGBDBM429270(acs.jmedchem.1c00409_ST.668 | jm5b01461, Compound ...)
Affinity DataKi:  3.56E+4nM. Assay description: This is a review article. Please point to the original journal.
In DepthDetails ArticlePubMed
TargetReplicase polyprotein 1ab(Human SARS coronavirus (SARS-CoV) (Severe acute re...)
Michigan State University
LigandPNGBDBM429270(acs.jmedchem.1c00409_ST.668 | jm5b01461, Compound ...)
Affinity DataIC50:  3.84E+4nM. Assay description: This is a review article.
In DepthDetails ArticlePubMed
TargetReplicase polyprotein 1ab(Human SARS coronavirus (SARS-CoV) (Severe acute re...)
Michigan State University
LigandPNGBDBM429270(acs.jmedchem.1c00409_ST.668 | jm5b01461, Compound ...)
Affinity DataIC50:  3.84E+4nM. Assay description: This is a review article. Please point to the original journal.
In DepthDetails ArticlePubMed