BDBM429317 jm5b01461, Compound 137
SMILES OC(=O)c1ccc(\C=C2\C(NN(C2=O)c2ccc(cc2)[N+]([O-])=O)c2ccccc2)cc1
InChI Key InChIKey=XCVLMMDZZIPDBC-ZHZULCJRSA-N
Data  2 IC50
  Tab Delimited (TSV)   2D SDfile   Computed 3D by Vconf -m prep SDfile
Find this compound or compounds like it in BindingDB:
Activity Spreadsheet -- Enzyme Inhibition Constant Data from BindingDB
Found 2 hits for monomerid = 429317
TargetReplicase polyprotein 1ab(Human SARS coronavirus (SARS-CoV) (Severe acute re...)
University Of Bonn
LigandPNGBDBM429317(jm5b01461, Compound 137)
Affinity DataIC50:  8.40E+3nM. Assay description: This is a review article.
Ligand InfoPC cidPC sid
In DepthDetails ArticlePubMed
TargetReplicase polyprotein 1ab(Human SARS coronavirus (SARS-CoV) (Severe acute re...)
University Of Bonn
LigandPNGBDBM429317(jm5b01461, Compound 137)
Affinity DataIC50:  8.40E+3nM. Assay description: This is a review article.
Ligand InfoPC cidPC sid
In DepthDetails ArticlePubMed