BDBM429333 med.21724, Compound 35
SMILES CCOC(=O)C=C[C@H](C[C@@H]1CNC(=O)C1)NC(=O)[C@H](CC(C)C)CC(=O)[C@@H](NC(=O)[C@H](CO)NC(=O)OC(C)(C)C)C(C)C
InChI Key InChIKey=GFSHYSCDWLGTGF-OSFWYOTNSA-N
Data  1 KI
  Tab Delimited (TSV)   2D SDfile   Computed 3D by Vconf -m prep SDfile
Find this compound or compounds like it in BindingDB:
Activity Spreadsheet -- Enzyme Inhibition Constant Data from BindingDB
Found 1 hit for monomerid = 429333
TargetOrf1a protein(MERS-CoV)
University Of Bonn
LigandPNGBDBM429333(med.21724, Compound 35)
Affinity DataKi:  3.60E+3nM. Assay description: This is a review article.
Ligand InfoPC cidPC sid
In DepthDetails ArticlePubMed