BDBM429334 acs.jmedchem.1c00409_ST.699::jm5b01461, Compound 151
SMILES CC(C)(C)NC(=O)C(N(C(=O)c1ncco1)c1ccc(cc1)C(C)(C)C)c1cccnc1
InChI Key InChIKey=DHFSVLXJSGMOHT-UHFFFAOYSA-N
Data  2 IC50
  Tab Delimited (TSV)   2D SDfile   Computed 3D by Vconf -m prep SDfile
Find this compound or compounds like it in BindingDB:
Activity Spreadsheet -- Enzyme Inhibition Constant Data from BindingDB
Found 2 hits for monomerid = 429334
TargetReplicase polyprotein 1ab(Human SARS coronavirus (SARS-CoV) (Severe acute re...)
Michigan State University
LigandPNGBDBM429334(acs.jmedchem.1c00409_ST.699 | jm5b01461, Compound ...)
Affinity DataIC50:  4.70E+4nM. Assay description: This is a review article. Please point to the original journal.
Ligand InfoPC cidPC sid
In DepthDetails ArticlePubMed
TargetReplicase polyprotein 1ab(Human SARS coronavirus (SARS-CoV) (Severe acute re...)
Michigan State University
LigandPNGBDBM429334(acs.jmedchem.1c00409_ST.699 | jm5b01461, Compound ...)
Affinity DataIC50:  4.70E+4nM. Assay description: This is a review article.
Ligand InfoPC cidPC sid
In DepthDetails ArticlePubMed