BDBM429527 5-Fluoro-3-(6-isobutoxypyridin-3-yl)-1-methyl-N-(methylsulfonyl)-1H-indole-6-carboxamide::US10550080, Example 44
SMILES CC(C)COc1ccc(cn1)-c1cn(C)c2cc(C(=O)NS(C)(=O)=O)c(F)cc12
InChI Key InChIKey=PLCCMQZNQDPYTG-UHFFFAOYSA-N
Data  15 IC50
  Tab Delimited (TSV)   2D SDfile   Computed 3D by Vconf -m prep SDfile
Find this compound or compounds like it in BindingDB:
Activity Spreadsheet -- Enzyme Inhibition Constant Data from BindingDB
Found 15 hits for monomerid = 429527
TargetSodium channel protein type 9 subunit alpha(Homo sapiens (Human))
Bristol-Myers Squibb
US Patent
LigandPNGBDBM429527(5-Fluoro-3-(6-isobutoxypyridin-3-yl)-1-methyl-N-(m...)
Affinity DataIC50:  104nM. Assay description: Ion Works Barracuda population patch clamp (PPC). PPC measurements were performed using an IonWorks Barracuda instrument (Molecular Devices Corporati...
Ligand InfoPC cidPC sid
In DepthDetails US Patent
TargetSodium channel protein type 9 subunit alpha(Homo sapiens (Human))
Bristol-Myers Squibb
US Patent
LigandPNGBDBM429527(5-Fluoro-3-(6-isobutoxypyridin-3-yl)-1-methyl-N-(m...)
Affinity DataIC50:  25nM. Assay description: Inhibition of recombinant human Nav1.7 expressed in HEK293 cells at -70 mV holding potential by patch clamp electrophysiology method
Ligand InfoPC cidPC sid
In DepthDetails ArticlePubMed
TargetSodium channel protein type 5 subunit alpha(Homo sapiens (Human))
Bristol-Myers Squibb
US Patent
LigandPNGBDBM429527(5-Fluoro-3-(6-isobutoxypyridin-3-yl)-1-methyl-N-(m...)
Affinity DataIC50:  1.87E+4nM. Assay description: Ion Works Barracuda population patch clamp (PPC). PPC measurements were performed using an IonWorks Barracuda instrument (Molecular Devices Corporati...
Ligand InfoPC cidPC sid
In DepthDetails US Patent
TargetSodium channel protein type 9 subunit alpha(Homo sapiens (Human))
Bristol-Myers Squibb
US Patent
LigandPNGBDBM429527(5-Fluoro-3-(6-isobutoxypyridin-3-yl)-1-methyl-N-(m...)
Affinity DataIC50:  89nM. Assay description: Inhibition of human Nav1.7 expressed in HEK293 cells after 600 secs at -60 mV holding potential by ion works barracuda population patch clamp method
Ligand InfoPC cidPC sid
In DepthDetails ArticlePubMed
TargetSodium channel protein type 5 subunit alpha(Homo sapiens (Human))
Bristol-Myers Squibb
US Patent
LigandPNGBDBM429527(5-Fluoro-3-(6-isobutoxypyridin-3-yl)-1-methyl-N-(m...)
Affinity DataIC50:  1.60E+4nM. Assay description: Inhibition of human Nav1.5 expressed in HEK293 cells after 600 secs at -50 mV holding potential by ion works barracuda population patch clamp method
Ligand InfoPC cidPC sid
In DepthDetails ArticlePubMed
TargetCytochrome P450 2B6(Homo sapiens (Human))
Bristol-Myers Squibb Research And Development
Curated by ChEMBL
LigandPNGBDBM429527(5-Fluoro-3-(6-isobutoxypyridin-3-yl)-1-methyl-N-(m...)
Affinity DataIC50: >4.00E+4nM. Assay description: Inhibition of CYP2B6 in human liver microsomes
Ligand InfoPC cidPC sid
In DepthDetails ArticlePubMed
TargetCytochrome P450 2C19(Homo sapiens (Human))
Bristol-Myers Squibb Research And Development
Curated by ChEMBL
LigandPNGBDBM429527(5-Fluoro-3-(6-isobutoxypyridin-3-yl)-1-methyl-N-(m...)
Affinity DataIC50:  4.00E+3nM. Assay description: Inhibition of CYP2C19 in human liver microsomes
Ligand InfoPC cidPC sid
In DepthDetails ArticlePubMed
TargetCytochrome P450 3A4(Homo sapiens (Human))
Bristol-Myers Squibb Research And Development
Curated by ChEMBL
LigandPNGBDBM429527(5-Fluoro-3-(6-isobutoxypyridin-3-yl)-1-methyl-N-(m...)
Affinity DataIC50:  1.50E+4nM. Assay description: Inhibition of CYP3A4 in human liver microsomes
Ligand InfoPC cidPC sid
In DepthDetails ArticlePubMed
TargetSodium channel protein type 9 subunit alpha(Mus musculus)
Bristol-Myers Squibb Research And Development
Curated by ChEMBL
LigandPNGBDBM429527(5-Fluoro-3-(6-isobutoxypyridin-3-yl)-1-methyl-N-(m...)
Affinity DataIC50:  115nM. Assay description: Inhibition of recombinant mouse Nav1.7 expressed in HEK293 cells at -70 mV holding potential by patch clamp electrophysiology method
Ligand InfoPC cidPC sid
In DepthDetails ArticlePubMed
TargetSodium channel protein type 9 subunit alpha(Mus musculus)
Bristol-Myers Squibb Research And Development
Curated by ChEMBL
LigandPNGBDBM429527(5-Fluoro-3-(6-isobutoxypyridin-3-yl)-1-methyl-N-(m...)
Affinity DataIC50:  14nM. Assay description: Inhibition of Nav1.7 in mouse DRG neurons at -70 mV holding potential by patch clamp electrophysiology method
Ligand InfoPC cidPC sid
In DepthDetails ArticlePubMed
TargetCytochrome P450 2C8(Homo sapiens (Human))
Bristol-Myers Squibb Research And Development
Curated by ChEMBL
LigandPNGBDBM429527(5-Fluoro-3-(6-isobutoxypyridin-3-yl)-1-methyl-N-(m...)
Affinity DataIC50:  1.00E+3nM. Assay description: Inhibition of CYP2C8 in human liver microsomes
Ligand InfoPC cidPC sid
In DepthDetails ArticlePubMed
TargetCytochrome P450 2C9(Homo sapiens (Human))
Bristol-Myers Squibb Research And Development
Curated by ChEMBL
LigandPNGBDBM429527(5-Fluoro-3-(6-isobutoxypyridin-3-yl)-1-methyl-N-(m...)
Affinity DataIC50:  2.70E+4nM. Assay description: Inhibition of CYP2C9 in human liver microsomes
Ligand InfoPC cidPC sid
In DepthDetails ArticlePubMed
TargetCytochrome P450 2D6(Homo sapiens (Human))
Bristol-Myers Squibb Research And Development
Curated by ChEMBL
LigandPNGBDBM429527(5-Fluoro-3-(6-isobutoxypyridin-3-yl)-1-methyl-N-(m...)
Affinity DataIC50: >4.00E+4nM. Assay description: Inhibition of CYP2D6 in human liver microsomes
Ligand InfoPC cidPC sid
In DepthDetails ArticlePubMed
TargetNuclear receptor subfamily 1 group I member 2(Homo sapiens (Human))
Bristol-Myers Squibb Research And Development
Curated by ChEMBL
LigandPNGBDBM429527(5-Fluoro-3-(6-isobutoxypyridin-3-yl)-1-methyl-N-(m...)
Affinity DataIC50: >5.00E+4nM. Assay description: Inhibition of PXR (unknown origin)
Ligand InfoPC cidPC sid
In DepthDetails ArticlePubMed
TargetSodium channel protein type 9 subunit alpha(Homo sapiens (Human))
Bristol-Myers Squibb
US Patent
LigandPNGBDBM429527(5-Fluoro-3-(6-isobutoxypyridin-3-yl)-1-methyl-N-(m...)
Affinity DataIC50:  86nM. Assay description: hNaV1.7 binding affinities were determined with a filtration binding assay using purified membranes from HEK293 cells stably expressing hNaV1.7. HEK2...
Ligand InfoPC cidPC sid
In DepthDetails US Patent