BDBM431490 US10550105, Example 435::US10870641, Example 435::US11014913, Example 435
SMILES FC(F)(F)c1c(cn[nH]c1=O)N1CCCC1COc1cccc(c1)C(=O)N1CCN(CC1)c1ccc(cn1)C#N
InChI Key
Data  3 IC50
  Tab Delimited (TSV)   2D SDfile   Computed 3D by Vconf -m prep SDfile
Find this compound or compounds like it in BindingDB:
Activity Spreadsheet -- Enzyme Inhibition Constant Data from BindingDB
Found 3 hits for monomerid = 431490
TargetProtein mono-ADP-ribosyltransferase TIPARP(Human)
Ribon Therapeutics
US Patent
LigandPNGBDBM431490(US10550105, Example 435 | US10870641, Example 435 ...)
Affinity DataIC50: <100nM. Assay description: Displacement of Probe A, a biotinylated probe binding to the TIPARP active site, was measured using a time-resolved fluorescence energy transfer (TR-...
Ligand InfoPC cidPC sid
In DepthDetails US Patent
TargetProtein mono-ADP-ribosyltransferase TIPARP(Human)
Ribon Therapeutics
US Patent
LigandPNGBDBM431490(US10550105, Example 435 | US10870641, Example 435 ...)
Affinity DataIC50: <100nM. Assay description: Displacement of Probe A, a biotinylated probe binding to the TIPARP active site, was measured using a time-resolved fluorescence energy transfer (TR-...
Ligand InfoPC cidPC sid
In DepthDetails US Patent
TargetProtein mono-ADP-ribosyltransferase TIPARP(Human)
Ribon Therapeutics
US Patent
LigandPNGBDBM431490(US10550105, Example 435 | US10870641, Example 435 ...)
Affinity DataIC50: <100nM. Assay description: Displacement of Probe A, a biotinylated probe binding to the TIPARP active site, was measured using a time-resolved fluorescence energy transfer (TR-...
Ligand InfoPC cidPC sid
In DepthDetails US Patent