BDBM43174 2-(4-hydroxyphenyl)sulfonylacetic acid ethyl ester::MLS000736234::SMR000338484::cid_5100178::ethyl 2-(4-hydroxyphenyl)sulfonylacetate::ethyl 2-(4-hydroxyphenyl)sulfonylethanoate::ethyl 2-[(4-hydroxyphenyl)sulfonyl]acetate
SMILES CCOC(=O)CS(=O)(=O)c1ccc(O)cc1
InChI Key InChIKey=OXUQFZVZJDLHGC-UHFFFAOYSA-N
Data  3 EC50
  Tab Delimited (TSV)   2D SDfile   Computed 3D by Vconf -m prep SDfile
Find this compound or compounds like it in BindingDB:
Activity Spreadsheet -- Enzyme Inhibition Constant Data from BindingDB
Found 3 hits for monomerid = 43174
TargetNuclear receptor coactivator 2(Homo sapiens (Human))
The Scripps Research Institute Molecular Screening Center
Curated by PubChem BioAssay
LigandPNGBDBM43174(2-(4-hydroxyphenyl)sulfonylacetic acid ethyl ester...)
Affinity DataEC50: >7.94E+4nM. Assay description: Source (MLSCN Center Name): The Scripps Research Institute Molecular Screening Center Center Affiliation: The Scripps Research Institute (TSRI) Assay...
In DepthDetails PCBioAssay
TargetNuclear receptor coactivator 3(Homo sapiens (Human))
The Scripps Research Institute Molecular Screening Center
Curated by PubChem BioAssay
LigandPNGBDBM43174(2-(4-hydroxyphenyl)sulfonylacetic acid ethyl ester...)
Affinity DataEC50: >7.94E+4nM. Assay description: Source (MLSCN Center Name): The Scripps Research Institute Molecular Screening Center http://molscreen.florida.scripps.edu/ Center Affiliation: The ...
In DepthDetails PCBioAssay
TargetNuclear receptor coactivator 1(Homo sapiens (Human))
The Scripps Research Institute Molecular Screening Center
Curated by PubChem BioAssay
LigandPNGBDBM43174(2-(4-hydroxyphenyl)sulfonylacetic acid ethyl ester...)
Affinity DataEC50: >7.94E+4nM. Assay description: Source (MLSCN Center Name): The Scripps Research Institute Molecular Screening Center Center Affiliation: The Scripps Research Institute (TSRI) Assay...
In DepthDetails PCBioAssay