BDBM431759 (S)-4-(Trifluoromethyl)-5-((1-(2-[(4-(5-(trifluoromethyl)thiazol-2-yl)piperazin-1-yl)sulfonyl)ethoxy)propan-2-yl)oxy)pyridazin-3(2H)-one::US10550105, Example 625::US10870641, Example 625::US11014913, Example 625
SMILES C[C@@H](COCCS(=O)(=O)N1CCN(CC1)c1ncc(s1)C(F)(F)F)Oc1cn[nH]c(=O)c1C(F)(F)F
InChI Key
Data  3 IC50
  Tab Delimited (TSV)   2D SDfile   Computed 3D by Vconf -m prep SDfile
Find this compound or compounds like it in BindingDB:
Activity Spreadsheet -- Enzyme Inhibition Constant Data from BindingDB
Found 3 hits for monomerid = 431759
TargetProtein mono-ADP-ribosyltransferase TIPARP(Human)
Ribon Therapeutics
US Patent
LigandPNGBDBM431759((S)-4-(Trifluoromethyl)-5-((1-(2-[(4-(5-(trifluoro...)
Affinity DataIC50: <100nM. Assay description: Displacement of Probe A, a biotinylated probe binding to the TIPARP active site, was measured using a time-resolved fluorescence energy transfer (TR-...
Ligand InfoPC cidPC sid
In DepthDetails US Patent
TargetProtein mono-ADP-ribosyltransferase TIPARP(Human)
Ribon Therapeutics
US Patent
LigandPNGBDBM431759((S)-4-(Trifluoromethyl)-5-((1-(2-[(4-(5-(trifluoro...)
Affinity DataIC50: <100nM. Assay description: Displacement of Probe A, a biotinylated probe binding to the TIPARP active site, was measured using a time-resolved fluorescence energy transfer (TR-...
Ligand InfoPC cidPC sid
In DepthDetails US Patent
TargetProtein mono-ADP-ribosyltransferase TIPARP(Human)
Ribon Therapeutics
US Patent
LigandPNGBDBM431759((S)-4-(Trifluoromethyl)-5-((1-(2-[(4-(5-(trifluoro...)
Affinity DataIC50: <100nM. Assay description: Displacement of Probe A, a biotinylated probe binding to the TIPARP active site, was measured using a time-resolved fluorescence energy transfer (TR-...
Ligand InfoPC cidPC sid
In DepthDetails US Patent