BDBM433374 US10562850, Compound 62c::US11066360, Compound 62c
SMILES NC(CCC1CC1)(c1ccc(F)c(NC(=O)[C@H]2C[C@@H](O)CN2C(=O)Nc2ccc(Cl)cn2)c1)c1ccccn1
InChI Key InChIKey=KXFZKEZPEDQJMM-JLGCCPRNSA-N
Data  2 KI
  Tab Delimited (TSV)   2D SDfile   Computed 3D by Vconf -m prep SDfile
Find this compound or compounds like it in BindingDB:
Activity Spreadsheet -- Enzyme Inhibition Constant Data from BindingDB
Found 2 hits for monomerid = 433374
TargetPlasma kallikrein(Homo sapiens (Human))
Biocryst Pharmaceuticals
US Patent
LigandPNGBDBM433374(US10562850, Compound 62c | US11066360, Compound 62...)
Affinity DataKi: <50nM. Assay description: The effect of compounds of the invention on human plasma kallikrein activity was determined using the chromogenic substrates (DiaPharma Group, Inc., ...
Ligand InfoPC cidPC sid
In DepthDetails US Patent
TargetPlasma kallikrein(Homo sapiens (Human))
Biocryst Pharmaceuticals
US Patent
LigandPNGBDBM433374(US10562850, Compound 62c | US11066360, Compound 62...)
Affinity DataKi: <50nM. Assay description: The effect of compounds of the invention on human plasma kallikrein activity was determined using the chromogenic substrates. In these experiments, 2...
Ligand InfoPC cidPC sid
In DepthDetails US Patent