BDBM433417 US10562850, Compound 60a::US11066360, Compound 60a
SMILES O[C@@H]1C[C@@H](N(C1)C(=O)Nc1ccc(Cl)cc1)C(=O)Nc1cc(ccc1F)[C@H](NCC1CC1)c1cccc(c1)C#N
InChI Key InChIKey=SQGKFOGUTRWMGA-RYRVMRHHSA-N
Data  2 KI
  Tab Delimited (TSV)   2D SDfile   Computed 3D by Vconf -m prep SDfile
Find this compound or compounds like it in BindingDB:
Activity Spreadsheet -- Enzyme Inhibition Constant Data from BindingDB
Found 2 hits for monomerid = 433417
TargetPlasma kallikrein(Homo sapiens (Human))
Biocryst Pharmaceuticals
US Patent
LigandPNGBDBM433417(US10562850, Compound 60a | US11066360, Compound 60...)
Affinity DataKi: >100nM. Assay description: The effect of compounds of the invention on human plasma kallikrein activity was determined using the chromogenic substrates (DiaPharma Group, Inc., ...
Ligand InfoPC cidPC sid
In DepthDetails US Patent
TargetPlasma kallikrein(Homo sapiens (Human))
Biocryst Pharmaceuticals
US Patent
LigandPNGBDBM433417(US10562850, Compound 60a | US11066360, Compound 60...)
Affinity DataKi: >100nM. Assay description: The effect of compounds of the invention on human plasma kallikrein activity was determined using the chromogenic substrates. In these experiments, 2...
Ligand InfoPC cidPC sid
In DepthDetails US Patent