BDBM433421 US10562850, Compound 10b::US11066360, Compound 10b
SMILES CC(C)(C)[S@@](=O)NC(CCC1CC1)(c1cccc(c1)C#N)c1ccc(F)c(NC(=O)[C@@H]2C[C@H](O)CN2C(=O)Nc2ccc(Cl)cc2)c1
InChI Key InChIKey=MJBIFAIWKFMNPW-GVNGFNKKSA-N
Data  2 KI
  Tab Delimited (TSV)   2D SDfile   Computed 3D by Vconf -m prep SDfile
Find this compound or compounds like it in BindingDB:
Activity Spreadsheet -- Enzyme Inhibition Constant Data from BindingDB
Found 2 hits for monomerid = 433421
TargetPlasma kallikrein(Homo sapiens (Human))
Biocryst Pharmaceuticals
US Patent
LigandPNGBDBM433421(US10562850, Compound 10b | US11066360, Compound 10...)
Affinity DataKi: >100nM. Assay description: The effect of compounds of the invention on human plasma kallikrein activity was determined using the chromogenic substrates (DiaPharma Group, Inc., ...
Ligand InfoPC cidPC sid
In DepthDetails US Patent
TargetPlasma kallikrein(Homo sapiens (Human))
Biocryst Pharmaceuticals
US Patent
LigandPNGBDBM433421(US10562850, Compound 10b | US11066360, Compound 10...)
Affinity DataKi: >100nM. Assay description: The effect of compounds of the invention on human plasma kallikrein activity was determined using the chromogenic substrates. In these experiments, 2...
Ligand InfoPC cidPC sid
In DepthDetails US Patent