BDBM433425 US10562850, Compound 67b::US11066360, Compound 67b
SMILES CCNC(CCC1CC1)(c1ccccc1)c1ccc(F)c(NC(=O)[C@H]2C[C@H](CN2C(=O)Nc2ccc(Cl)cn2)OC)c1
InChI Key InChIKey=LUJTUEOORDUTPD-OHCGPUKPSA-N
Data  2 KI
  Tab Delimited (TSV)   2D SDfile   Computed 3D by Vconf -m prep SDfile
Find this compound or compounds like it in BindingDB:
Activity Spreadsheet -- Enzyme Inhibition Constant Data from BindingDB
Found 2 hits for monomerid = 433425
TargetPlasma kallikrein(Homo sapiens (Human))
Biocryst Pharmaceuticals
US Patent
LigandPNGBDBM433425(US10562850, Compound 67b | US11066360, Compound 67...)
Affinity DataKi: >100nM. Assay description: The effect of compounds of the invention on human plasma kallikrein activity was determined using the chromogenic substrates (DiaPharma Group, Inc., ...
Ligand InfoPC cidPC sid
In DepthDetails US Patent
TargetPlasma kallikrein(Homo sapiens (Human))
Biocryst Pharmaceuticals
US Patent
LigandPNGBDBM433425(US10562850, Compound 67b | US11066360, Compound 67...)
Affinity DataKi: >100nM. Assay description: The effect of compounds of the invention on human plasma kallikrein activity was determined using the chromogenic substrates. In these experiments, 2...
Ligand InfoPC cidPC sid
In DepthDetails US Patent