BDBM433428 US10562850, Compound 38d::US11066360, Compound 38d
SMILES CCC1(O)C[C@@H](N(C1)C(=O)OC(C)(C)C)C(=O)Nc1cc(ccc1F)C(CCC1CC1)(N[S@@](=O)C(C)(C)C)c1ccccn1
InChI Key InChIKey=LFTPBCWVQLYAOS-PAOCNZHCSA-N
Data  2 KI
  Tab Delimited (TSV)   2D SDfile   Computed 3D by Vconf -m prep SDfile
Find this compound or compounds like it in BindingDB:
Activity Spreadsheet -- Enzyme Inhibition Constant Data from BindingDB
Found 2 hits for monomerid = 433428
TargetPlasma kallikrein(Homo sapiens (Human))
Biocryst Pharmaceuticals
US Patent
LigandPNGBDBM433428(US10562850, Compound 38d | US11066360, Compound 38...)
Affinity DataKi: <50nM. Assay description: The effect of compounds of the invention on human plasma kallikrein activity was determined using the chromogenic substrates (DiaPharma Group, Inc., ...
Ligand InfoPC cidPC sid
In DepthDetails US Patent
TargetPlasma kallikrein(Homo sapiens (Human))
Biocryst Pharmaceuticals
US Patent
LigandPNGBDBM433428(US10562850, Compound 38d | US11066360, Compound 38...)
Affinity DataKi: <50nM. Assay description: The effect of compounds of the invention on human plasma kallikrein activity was determined using the chromogenic substrates. In these experiments, 2...
Ligand InfoPC cidPC sid
In DepthDetails US Patent