BDBM433468 US10562850, Compound 84a::US11066360, Compound 84a
SMILES CO[C@@H]1C[C@@H](N(C1)C(=O)c1ccc(Cl)c(N)c1)C(=O)Nc1cc(ccc1F)C(N)(CCC1CC1)c1ccncc1
InChI Key InChIKey=SUBHSHKRDIKUKN-MPCSXZBSSA-N
Data  2 KI
  Tab Delimited (TSV)   2D SDfile   Computed 3D by Vconf -m prep SDfile
Find this compound or compounds like it in BindingDB:
Activity Spreadsheet -- Enzyme Inhibition Constant Data from BindingDB
Found 2 hits for monomerid = 433468
TargetPlasma kallikrein(Homo sapiens (Human))
Biocryst Pharmaceuticals
US Patent
LigandPNGBDBM433468(US10562850, Compound 84a | US11066360, Compound 84...)
Affinity DataKi: >100nM. Assay description: The effect of compounds of the invention on human plasma kallikrein activity was determined using the chromogenic substrates (DiaPharma Group, Inc., ...
Ligand InfoPC cidPC sid
In DepthDetails US Patent
TargetPlasma kallikrein(Homo sapiens (Human))
Biocryst Pharmaceuticals
US Patent
LigandPNGBDBM433468(US10562850, Compound 84a | US11066360, Compound 84...)
Affinity DataKi: >100nM. Assay description: The effect of compounds of the invention on human plasma kallikrein activity was determined using the chromogenic substrates. In these experiments, 2...
Ligand InfoPC cidPC sid
In DepthDetails US Patent