BDBM434098 US10562891, Example 20::US11008308, Example 20
SMILES Cc1cccc2c1nc(CSC1CCCNCC1)[nH]c2=O
InChI Key
Data  2 IC50
  Tab Delimited (TSV)   2D SDfile   Computed 3D by Vconf -m prep SDfile
Find this compound or compounds like it in BindingDB:
Activity Spreadsheet -- Enzyme Inhibition Constant Data from BindingDB
Found 2 hits for monomerid = 434098
TargetProtein mono-ADP-ribosyltransferase PARP14(Homo sapiens (Human))
Ribon Therapeutics
US Patent
LigandPNGBDBM434098(US10562891, Example 20 | US11008308, Example 20)
Affinity DataIC50: <1.00E+3nM. Assay description: Enzymatic inhibition of PARP14 was measured using a dissociation-enhanced lanthanide fluorescence immunoassay (DELFIA) monitoring the auto-modificati...
Ligand InfoPC cidPC sid
In DepthDetails US Patent
TargetProtein mono-ADP-ribosyltransferase PARP14 [1611-1801](Homo sapiens (Human))
Ribon Therapeutics
US Patent
LigandPNGBDBM434098(US10562891, Example 20 | US11008308, Example 20)
Affinity DataIC50: <1.00E+3nM. Assay description: Enzymatic inhibition of PARP14 was measured using a dissociation-enhanced lanthanide fluorescence immunoassay (DELFIA) monitoring the auto-modificati...
Ligand InfoPC cidPC sid
In DepthDetails US Patent