BDBM435820 US10570167, Cpd. # 136::US11034715, Cpd. # 136
SMILES CC(=O)Nc1ccc(CC(OC[C@H]2O[C@H]([C@@H](F)[C@@H]2O)n2cnc3c(N)nc(Cl)nc23)(C(O)=O)C(O)=O)cc1
InChI Key InChIKey=FWXXBQYSQFBYKK-ZFHGCVPZSA-N
Data  4 IC50
  Tab Delimited (TSV)   2D SDfile   Computed 3D by Vconf -m prep SDfile
Find this compound or compounds like it in BindingDB:
Activity Spreadsheet -- Enzyme Inhibition Constant Data from BindingDB
Found 4 hits for monomerid = 435820
Target5'-nucleotidase(Homo sapiens (Human))
Calithera Biosciences
US Patent
LigandPNGBDBM435820(US10570167, Cpd. # 136 | US11034715, Cpd. # 136)
Affinity DataIC50:  110nM. Assay description: For measurements of soluble CD73 enzyme activity, recombinant CD73 was obtained from R&D Systems, Cat. No. 5795-EN-010. Serial dilutions of test comp...
Ligand InfoPC cidPC sid
In DepthDetails US Patent
Target5'-nucleotidase(Homo sapiens (Human))
Calithera Biosciences
US Patent
LigandPNGBDBM435820(US10570167, Cpd. # 136 | US11034715, Cpd. # 136)
Affinity DataIC50:  1.87E+3nM. Assay description: The ability of compounds to inhibit endogenous, cell-bound CD73 enzyme activity was demonstrated using SK-MEL-28 cells, which express CD73 on their s...
Ligand InfoPC cidPC sid
In DepthDetails US Patent
Target5'-nucleotidase(Homo sapiens (Human))
Calithera Biosciences
US Patent
LigandPNGBDBM435820(US10570167, Cpd. # 136 | US11034715, Cpd. # 136)
Affinity DataIC50:  110nM. Assay description: For measurements of soluble CD73 enzyme activity, recombinant CD73 was obtained from R&D Systems, Cat. No. 5795-EN-010. Serial dilutions of test comp...
Ligand InfoPC cidPC sid
In DepthDetails US Patent
Target5'-nucleotidase(Homo sapiens (Human))
Calithera Biosciences
US Patent
LigandPNGBDBM435820(US10570167, Cpd. # 136 | US11034715, Cpd. # 136)
Affinity DataIC50:  1.87E+3nM. Assay description: For measurements of soluble CD73 enzyme activity, recombinant CD73 was obtained from R&D Systems, Cat. No. 5795-EN-010. Serial dilutions of test comp...
Ligand InfoPC cidPC sid
In DepthDetails US Patent