BDBM435839 US10570167, Cpd. # 159::US11034715, Cpd. # 159
SMILES Nc1ncc(cn1)-c1ccc(CC(OC[C@H]2O[C@H]([C@@H](F)[C@@H]2O)n2cnc3c(N)nc(Cl)nc23)(C(O)=O)C(O)=O)cc1
InChI Key InChIKey=QTHMPXHZGJAUTD-QHHYFVSCSA-N
Data  2 IC50
  Tab Delimited (TSV)   2D SDfile   Computed 3D by Vconf -m prep SDfile
Find this compound or compounds like it in BindingDB:
Activity Spreadsheet -- Enzyme Inhibition Constant Data from BindingDB
Found 2 hits for monomerid = 435839
Target5'-nucleotidase(Homo sapiens (Human))
Calithera Biosciences
US Patent
LigandPNGBDBM435839(US10570167, Cpd. # 159 | US11034715, Cpd. # 159)
Affinity DataIC50:  76nM. Assay description: For measurements of soluble CD73 enzyme activity, recombinant CD73 was obtained from R&D Systems, Cat. No. 5795-EN-010. Serial dilutions of test comp...
Ligand InfoPC cidPC sid
In DepthDetails US Patent
Target5'-nucleotidase(Homo sapiens (Human))
Calithera Biosciences
US Patent
LigandPNGBDBM435839(US10570167, Cpd. # 159 | US11034715, Cpd. # 159)
Affinity DataIC50:  76nM. Assay description: For measurements of soluble CD73 enzyme activity, recombinant CD73 was obtained from R&D Systems, Cat. No. 5795-EN-010. Serial dilutions of test comp...
Ligand InfoPC cidPC sid
In DepthDetails US Patent