BDBM435840 US10570167, Cpd. # 160::US11034715, Cpd. # 160
SMILES Nc1nc(Cl)nc2n(cnc12)[C@@H]1O[C@H](COC(Cc2ccc(cc2)-c2ccccc2O)(C(O)=O)C(O)=O)[C@@H](O)[C@@H]1F
InChI Key InChIKey=KYCZLTBZYDKHMV-ZRAXVTTISA-N
Data  2 IC50
  Tab Delimited (TSV)   2D SDfile   Computed 3D by Vconf -m prep SDfile
Find this compound or compounds like it in BindingDB:
Activity Spreadsheet -- Enzyme Inhibition Constant Data from BindingDB
Found 2 hits for monomerid = 435840
Target5'-nucleotidase(Homo sapiens (Human))
Calithera Biosciences
US Patent
LigandPNGBDBM435840(US10570167, Cpd. # 160 | US11034715, Cpd. # 160)
Affinity DataIC50:  12nM. Assay description: For measurements of soluble CD73 enzyme activity, recombinant CD73 was obtained from R&D Systems, Cat. No. 5795-EN-010. Serial dilutions of test comp...
Ligand InfoPC cidPC sid
In DepthDetails US Patent
Target5'-nucleotidase(Homo sapiens (Human))
Calithera Biosciences
US Patent
LigandPNGBDBM435840(US10570167, Cpd. # 160 | US11034715, Cpd. # 160)
Affinity DataIC50:  12nM. Assay description: For measurements of soluble CD73 enzyme activity, recombinant CD73 was obtained from R&D Systems, Cat. No. 5795-EN-010. Serial dilutions of test comp...
Ligand InfoPC cidPC sid
In DepthDetails US Patent