BDBM435841 US10570167, Cpd. # 162::US11034715, Cpd. # 162
SMILES Nc1nc(Cl)nc2n(cnc12)[C@@H]1O[C@H](COC(Cc2ccc(cc2)N2CCCC2=O)(C(O)=O)C(O)=O)[C@@H](O)[C@@H]1F
InChI Key InChIKey=BJGGBYAYKLZEEY-YBLQJDFOSA-N
Data  2 IC50
  Tab Delimited (TSV)   2D SDfile   Computed 3D by Vconf -m prep SDfile
Find this compound or compounds like it in BindingDB:
Activity Spreadsheet -- Enzyme Inhibition Constant Data from BindingDB
Found 2 hits for monomerid = 435841
Target5'-nucleotidase(Homo sapiens (Human))
Calithera Biosciences
US Patent
LigandPNGBDBM435841(US10570167, Cpd. # 162 | US11034715, Cpd. # 162)
Affinity DataIC50:  54nM. Assay description: For measurements of soluble CD73 enzyme activity, recombinant CD73 was obtained from R&D Systems, Cat. No. 5795-EN-010. Serial dilutions of test comp...
Ligand InfoPC cidPC sid
In DepthDetails US Patent
Target5'-nucleotidase(Homo sapiens (Human))
Calithera Biosciences
US Patent
LigandPNGBDBM435841(US10570167, Cpd. # 162 | US11034715, Cpd. # 162)
Affinity DataIC50:  54nM. Assay description: For measurements of soluble CD73 enzyme activity, recombinant CD73 was obtained from R&D Systems, Cat. No. 5795-EN-010. Serial dilutions of test comp...
Ligand InfoPC cidPC sid
In DepthDetails US Patent