BDBM437425 2-(4-(5-(1-benzyl-1H-pyrazol-4-yl)-1-methyl-2-oxo-1,2- dihydropyridin-4-yl)-1H-pyrazol-1-yl)acetic acid::US10617680, Example 159::US11020380, Example 159
SMILES Cn1cc(-c2cnn(Cc3ccccc3)c2)c(cc1=O)-c1cnn(CC(O)=O)c1
InChI Key InChIKey=DWTGKRAJGTYEGG-UHFFFAOYSA-N
Data  2 IC50
  Tab Delimited (TSV)   2D SDfile   Computed 3D by Vconf -m prep SDfile
Find this compound or compounds like it in BindingDB:
Activity Spreadsheet -- Enzyme Inhibition Constant Data from BindingDB
Found 2 hits for monomerid = 437425
TargetCREB-binding protein(Homo sapiens (Human))
Celgene Quanticel Research
US Patent
LigandPNGBDBM437425(2-(4-(5-(1-benzyl-1H-pyrazol-4-yl)-1-methyl-2-oxo-...)
Affinity DataIC50: <500nM. Assay description: The CBP-inhibitory activity of the compounds described herein was determined by calculating the IC50. More specifically, CBP inhibitor activity was a...
Ligand InfoPC cidPC sid
In DepthDetails US Patent
TargetCREB-binding protein(Homo sapiens (Human))
Celgene Quanticel Research
US Patent
LigandPNGBDBM437425(2-(4-(5-(1-benzyl-1H-pyrazol-4-yl)-1-methyl-2-oxo-...)
Affinity DataIC50: <500nM. Assay description: The CBP-inhibitory activity of the compounds described herein was determined by calculating the IC50. More specifically, CBP inhibitor activity was a...
Ligand InfoPC cidPC sid
In DepthDetails US Patent