BDBM442822 PR-619
SMILES Nc1nc(N)c(SC#N)cc1SC#N
InChI Key InChIKey=ZXOBLNBVNROVLC-UHFFFAOYSA-N
Data  2 IC50
  Tab Delimited (TSV)   2D SDfile   Computed 3D by Vconf -m prep SDfile
Find this compound or compounds like it in BindingDB:
Activity Spreadsheet -- Enzyme Inhibition Constant Data from BindingDB
Found 2 hits for monomerid = 442822
TargetReplicase polyprotein 1ab(2019-nCoV)
Fraunhofer Institute For Translational Medicine And Pharmacology (Itmp) And Fraunhofer Cluster Of Excellence For Immune Mediated Diseases (Cimd
LigandPNGBDBM442822(PR-619)
Affinity DataIC50:  4.41E+3nM. Assay description: Primary assay principle based on quenched FRET peptide substrate of SARS-CoV-2 3CL-Pro (lhs). Inhibiting compounds reduce fluorescence signal relativ...
In DepthDetails Article
TargetReplicase polyprotein 1ab(2019-nCoV)
Fraunhofer Institute For Translational Medicine And Pharmacology (Itmp) And Fraunhofer Cluster Of Excellence For Immune Mediated Diseases (Cimd
LigandPNGBDBM442822(PR-619)
Affinity DataIC50:  410nM. Assay description: Primary assay principle based on quenched FRET peptide substrate of SARS-CoV-2 3CL-Pro (lhs). Inhibiting compounds reduce fluorescence signal relativ...
In DepthDetails Article