BDBM448214 US10689401, EX 17::US11008338, Example 17
SMILES CC1(C)C[C@@H]2[C@](CO1)(NC(=N)C(C)(C)S2(=O)=O)c1ccccc1F
InChI Key InChIKey=HNBPJKODDGJDLI-CXAGYDPISA-N
Data  4 KI
  Tab Delimited (TSV)   2D SDfile   Computed 3D by Vconf -m prep SDfile
Find this compound or compounds like it in BindingDB:
Activity Spreadsheet -- Enzyme Inhibition Constant Data from BindingDB
Found 4 hits for monomerid = 448214
TargetBeta-secretase 2(Homo sapiens (Human))
Merck Sharp & Dohme
US Patent
LigandPNGBDBM448214(US10689401, EX 17 | US11008338, Example 17)
Affinity DataKi:  293nM. Assay description: BACE-2: Inhibitor IC50s at purified human autoBACE-2 are determined in a time-resolved endpoint proteolysis assay that measures hydrolysis of the QSY...
Ligand InfoPC cidPC sid
In DepthDetails US Patent
TargetBeta-secretase 2(Homo sapiens (Human))
Merck Sharp & Dohme
US Patent
LigandPNGBDBM448214(US10689401, EX 17 | US11008338, Example 17)
Affinity DataKi:  293nM. Assay description: BACE2: Inhibitor IC50s at purified human autoBACE-2 are determined in a time-resolved endpoint proteolysis assay that measures hydrolysis of the QSY7...
Ligand InfoPC cidPC sid
In DepthDetails US Patent
TargetBeta-secretase 1(Homo sapiens (Human))
Merck Sharp & Dohme
US Patent
LigandPNGBDBM448214(US10689401, EX 17 | US11008338, Example 17)
Affinity DataKi:  300nM. Assay description: BACE1: A homogeneous time-resolved FRET assay can be used to determine IC50 values for inhibitors of the soluble human BACE1 catalytic domain. This a...
Ligand InfoPC cidPC sid
In DepthDetails US Patent
TargetBeta-secretase 1(Homo sapiens (Human))
Merck Sharp & Dohme
US Patent
LigandPNGBDBM448214(US10689401, EX 17 | US11008338, Example 17)
Affinity DataKi:  300nM. Assay description: BACE1: A homogeneous time-resolved FRET assay can be used to determine IC50 values for inhibitors of the soluble human BACE1 catalytic domain. This a...
Ligand InfoPC cidPC sid
In DepthDetails US Patent