BDBM448271 MI-08
SMILES COc1ccc(OCC(=O)N2C[C@H]3[C@@H]([C@@H]2C(=O)N[C@@H](C[C@@H]2CCNC2=O)C=O)C3(C)C)cc1F
InChI Key InChIKey=ITLIZQKXLAJTCO-DNJHYJLBSA-N
Data  1 IC50
  Tab Delimited (TSV)   2D SDfile   Computed 3D by Vconf -m prep SDfile
Find this compound or compounds like it in BindingDB:
Activity Spreadsheet -- Enzyme Inhibition Constant Data from BindingDB
Found 1 hit for monomerid = 448271
TargetReplicase polyprotein 1ab(2019-nCoV)
Sichuan University
LigandPNGBDBM448271(MI-08)
Affinity DataIC50:  37nM. Assay description: The enzymatic inhibition assay was carried out with a final concentration of 100 nM recombinant SARS-CoV-2 Mpro and 20 μM FRET substrate. For th...
Ligand InfoPC cidPC sid
In DepthDetails ArticlePubMed