BDBM448298 MI-13
SMILES CC1(C)[C@H]2CN([C@H]([C@@H]12)C(=O)N[C@@H](C[C@@H]1CCNC1=O)C=O)C(=O)COc1ccc(Cl)c(Cl)c1
InChI Key InChIKey=WUFNYTJVPNYFBX-RAQRGPQBSA-N
Data  1 IC50
  Tab Delimited (TSV)   2D SDfile   Computed 3D by Vconf -m prep SDfile
Find this compound or compounds like it in BindingDB:
Activity Spreadsheet -- Enzyme Inhibition Constant Data from BindingDB
Found 1 hit for monomerid = 448298
TargetReplicase polyprotein 1ab(2019-nCoV)
Sichuan University
LigandPNGBDBM448298(MI-13)
Affinity DataIC50:  12nM. Assay description: The enzymatic inhibition assay was carried out with a final concentration of 100 nM recombinant SARS-CoV-2 Mpro and 20 μM FRET substrate. For th...
Ligand InfoPC cidPC sid
In DepthDetails ArticlePubMed