BDBM45049 4-[(2E)-2-[5-oxidanylidene-3-phenyl-1-(4-phenyl-1,3-thiazol-2-yl)pyrazol-4-ylidene]hydrazinyl]benzenesulfonamide::4-[(2E)-2-[5-oxo-3-phenyl-1-(4-phenyl-1,3-thiazol-2-yl)pyrazol-4-ylidene]hydrazinyl]benzenesulfonamide::4-[(2E)-2-[5-oxo-3-phenyl-1-(4-phenyl-2-thiazolyl)-4-pyrazolylidene]hydrazinyl]benzenesulfonamide::4-[(N'E)-N'-[5-keto-3-phenyl-1-(4-phenylthiazol-2-yl)-2-pyrazolin-4-ylidene]hydrazino]benzenesulfonamide::4-{2-[5-oxo-3-phenyl-1-(4-phenyl-1,3-thiazol-2-yl)-1,5-dihydro-4H-pyrazol-4-ylidene]hydrazino}benzenesulfonamide::MLS000570477::SMR000186903::cid_5725402
SMILES NS(=O)(=O)c1ccc(cc1)N=Nc1c([nH]n(-c2nc(cs2)-c2ccccc2)c1=O)-c1ccccc1
InChI Key InChIKey=DGWGSCHQWGTPNT-UHFFFAOYSA-N
Data  1 EC50
  Tab Delimited (TSV)   2D SDfile   Computed 3D by Vconf -m prep SDfile
Find this compound or compounds like it in BindingDB:
Activity Spreadsheet -- Enzyme Inhibition Constant Data from BindingDB
Found 1 hit for monomerid = 45049
TargetMultidrug resistance-associated protein 1(Homo sapiens (Human))
Srmlsc
Curated by PubChem BioAssay
LigandPNGBDBM45049(4-[(2E)-2-[5-oxidanylidene-3-phenyl-1-(4-phenyl-1,...)
Affinity DataEC50: <195nM. Assay description: Southern Research Molecular Libraries Screening Center (SRMLSC) Southern Research Institute (Birmingham, Alabama) NIH Molecular Libraries Screening C...
In DepthDetails PCBioAssay