BDBM451277 US10709709, Example 104
SMILES Nc1ncnc2n(cc(F)c12)[C@@H]1C[C@H](Oc2cc(cc3CCNCc23)C(F)(F)F)[C@@H](O)[C@H]1O
InChI Key InChIKey=FVXNKHKLMMJYRT-HUHSQHJXSA-N
Data  1 IC50
  Tab Delimited (TSV)   2D SDfile   Computed 3D by Vconf -m prep SDfile
Find this compound or compounds like it in BindingDB:
Activity Spreadsheet -- Enzyme Inhibition Constant Data from BindingDB
Found 1 hit for monomerid = 451277
TargetProtein arginine N-methyltransferase 5(Homo sapiens (Human))
Pfizer
US Patent
LigandPNGBDBM451277(US10709709, Example 104)
Affinity DataIC50:  1nM. Assay description: Compounds were solubilized in DMSO and serially diluted, using 3-fold dilutions, into 100% DMSO at a concentration 50-fold greater than the desired a...
Ligand InfoPC cidPC sid
In DepthDetails US Patent