BDBM451824 US10710980, Example 53::US10947218, Example 53
SMILES Nc1ncc(cc1C(=O)N[C@H]1CC[C@H](O)CC1)-c1ccc(cc1)[C@]12C[C@H]1CN(CC#C)C2
InChI Key InChIKey=MKKQYAXMQPGYNY-OYSWMMLKSA-N
Data  14 IC50
  Tab Delimited (TSV)   2D SDfile   Computed 3D by Vconf -m prep SDfile
Find this compound or compounds like it in BindingDB:
Activity Spreadsheet -- Enzyme Inhibition Constant Data from BindingDB
Found 14 hits for monomerid = 451824
TargetActivin receptor type-1 [172-499](Homo sapiens (Human))
Novartis
US Patent
LigandPNGBDBM451824(US10710980, Example 53 | US10947218, Example 53)
Affinity DataIC50:  13nM. Assay description: The assays were performed in 384-well, low volume microtiter assay plates in a final reaction volume of 6 ul. Dose-response curves were generated by ...
Ligand InfoPC cidPC sid
In DepthDetails US Patent
TargetBone morphogenetic protein receptor type-1A [198-525](Homo sapiens (Human))
Novartis
US Patent
LigandPNGBDBM451824(US10710980, Example 53 | US10947218, Example 53)
Affinity DataIC50:  1.20E+3nM. Assay description: The assays were performed in 384-well, low volume microtiter assay plates in a final reaction volume of 6 ul. Dose-response curves were generated by ...
Ligand InfoPC cidPC sid
In DepthDetails US Patent
TargetActivin receptor type-1 [172-499](Homo sapiens (Human))
Novartis
US Patent
LigandPNGBDBM451824(US10710980, Example 53 | US10947218, Example 53)
Affinity DataIC50:  32nM. Assay description: In the applied method, this separation takes place inside a chip that contains a complex capillary system for simultaneous analysis of 12 samples (“1...
Ligand InfoPC cidPC sid
In DepthDetails US Patent
TargetActivin receptor type-1 [172-499,R206H](Homo sapiens (Human))
Novartis
US Patent
LigandPNGBDBM451824(US10710980, Example 53 | US10947218, Example 53)
Affinity DataIC50:  20nM. Assay description: In the applied method, this separation takes place inside a chip that contains a complex capillary system for simultaneous analysis of 12 samples (“1...
Ligand InfoPC cidPC sid
In DepthDetails US Patent
TargetSerine/threonine-protein kinase receptor R3 [166-493](Homo sapiens (Human))
Novartis
US Patent
LigandPNGBDBM451824(US10710980, Example 53 | US10947218, Example 53)
Affinity DataIC50:  190nM. Assay description: In the applied method, this separation takes place inside a chip that contains a complex capillary system for simultaneous analysis of 12 samples (“1...
Ligand InfoPC cidPC sid
In DepthDetails US Patent
TargetTGF-beta receptor type-1 [162-503](Homo sapiens (Human))
Novartis
US Patent
LigandPNGBDBM451824(US10710980, Example 53 | US10947218, Example 53)
Affinity DataIC50:  2.00E+3nM. Assay description: In the applied method, this separation takes place inside a chip that contains a complex capillary system for simultaneous analysis of 12 samples (“1...
Ligand InfoPC cidPC sid
In DepthDetails US Patent
TargetBone morphogenetic protein receptor type-1B(Homo sapiens (Human))
Novartis
US Patent
LigandPNGBDBM451824(US10710980, Example 53 | US10947218, Example 53)
Affinity DataIC50:  2.50E+3nM. Assay description: A kinase selectivity panel which measures substrate peptide phosphorylation was set-up for wild-type ALK2 (aa172-499), ALK2 FOP mutant (aa172-499 R20...
Ligand InfoPC cidPC sid
In DepthDetails US Patent
TargetActivin receptor type-1 [172-499](Homo sapiens (Human))
Novartis
US Patent
LigandPNGBDBM451824(US10710980, Example 53 | US10947218, Example 53)
Affinity DataIC50:  13nM. Assay description: A kinase selectivity panel which measures autophosphorylation using the ADP-Glo Kinase Assay (Promega, V9101) was set-up for wild-type ALK2 (aa172-49...
Ligand InfoPC cidPC sid
In DepthDetails US Patent
TargetBone morphogenetic protein receptor type-1A [198-525](Homo sapiens (Human))
Novartis
US Patent
LigandPNGBDBM451824(US10710980, Example 53 | US10947218, Example 53)
Affinity DataIC50:  1.20E+3nM. Assay description: A kinase selectivity panel which measures autophosphorylation using the ADP-Glo Kinase Assay (Promega, V9101) was set-up for wild-type ALK2 (aa172-49...
Ligand InfoPC cidPC sid
In DepthDetails US Patent
TargetActivin receptor type-1 [172-499](Homo sapiens (Human))
Novartis
US Patent
LigandPNGBDBM451824(US10710980, Example 53 | US10947218, Example 53)
Affinity DataIC50:  32nM. Assay description: A kinase selectivity panel which measures substrate peptide phosphorylation was set-up for wild-type ALK2 (aa172-499), ALK2 FOP mutant (aa172-499 R20...
Ligand InfoPC cidPC sid
In DepthDetails US Patent
TargetActivin receptor type-1 [172-499,R206H](Homo sapiens (Human))
Novartis
US Patent
LigandPNGBDBM451824(US10710980, Example 53 | US10947218, Example 53)
Affinity DataIC50:  20nM. Assay description: A kinase selectivity panel which measures substrate peptide phosphorylation was set-up for wild-type ALK2 (aa172-499), ALK2 FOP mutant (aa172-499 R20...
Ligand InfoPC cidPC sid
In DepthDetails US Patent
TargetSerine/threonine-protein kinase receptor R3 [166-493](Homo sapiens (Human))
Novartis
US Patent
LigandPNGBDBM451824(US10710980, Example 53 | US10947218, Example 53)
Affinity DataIC50:  190nM. Assay description: A kinase selectivity panel which measures substrate peptide phosphorylation was set-up for wild-type ALK2 (aa172-499), ALK2 FOP mutant (aa172-499 R20...
Ligand InfoPC cidPC sid
In DepthDetails US Patent
TargetTGF-beta receptor type-1 [162-503](Homo sapiens (Human))
Novartis
US Patent
LigandPNGBDBM451824(US10710980, Example 53 | US10947218, Example 53)
Affinity DataIC50:  2.00E+3nM. Assay description: A kinase selectivity panel which measures substrate peptide phosphorylation was set-up for wild-type ALK2 (aa172-499), ALK2 FOP mutant (aa172-499 R20...
Ligand InfoPC cidPC sid
In DepthDetails US Patent
TargetBone morphogenetic protein receptor type-1B(Homo sapiens (Human))
Novartis
US Patent
LigandPNGBDBM451824(US10710980, Example 53 | US10947218, Example 53)
Affinity DataIC50:  2.50E+3nM. Assay description: In the applied method, this separation takes place inside a chip that contains a complex capillary system for simultaneous analysis of 12 samples (“1...
Ligand InfoPC cidPC sid
In DepthDetails US Patent