BDBM46737 (Z)-(4-chlorodithiazol-5-ylidene)-(2-pyridyl)amine::(Z)-4-chloranyl-N-pyridin-2-yl-1,2,3-dithiazol-5-imine::(Z)-4-chloro-N-(2-pyridinyl)-5-dithiazolimine::(Z)-4-chloro-N-pyridin-2-yldithiazol-5-imine::MLS-0391016.0001::cid_6112173
SMILES Clc1nss\c1=N/c1ccccn1
InChI Key InChIKey=UMUVFNVCTHWWQW-YFHOEESVSA-N
Data  1 IC50
  Tab Delimited (TSV)   2D SDfile   Computed 3D by Vconf -m prep SDfile
Find this compound or compounds like it in BindingDB:
Activity Spreadsheet -- Enzyme Inhibition Constant Data from BindingDB
Found 1 hit for monomerid = 46737
TargetMannose-6-phosphate isomerase(Homo sapiens (Human))
Burnham Center For Chemical Genomics
Curated by PubChem BioAssay
LigandPNGBDBM46737((Z)-(4-chlorodithiazol-5-ylidene)-(2-pyridyl)amine...)
Affinity DataIC50: >1.00E+5nM. Assay description: Data Source: Sanford-Burnham Center for Chemical Genomics (SBCCG) Source Affiliation: Sanford-Burnham Medical Research Institute (SBMRI, San Diego, C...
In DepthDetails PCBioAssay