BDBM469582 Compound 1-17::US11072585, Example 10
SMILES CN(C)[C@@]1(Cc2ccccc2)CC[C@]2(CN(C(=O)N2)c2cnc(cc2C)C(F)(F)F)CC1
InChI Key InChIKey=BQKQLYGFPMLQNZ-ZRZAMGCNSA-N
Data  1 IC50
  Tab Delimited (TSV)   2D SDfile   Computed 3D by Vconf -m prep SDfile
Find this compound or compounds like it in BindingDB:
Activity Spreadsheet -- Enzyme Inhibition Constant Data from BindingDB
Found 1 hit for monomerid = 469582
TargetLysyl oxidase homolog 2(Homo sapiens (Human))
Pharmakea
US Patent
LigandPNGBDBM469582(Compound 1-17 | US11072585, Example 10)
Affinity DataIC50: <300nM. Assay description: LOXL2 amine oxidase activity is evaluated by measuring Amplex Red fluorescence using 10-20× concentrated conditioned media from CHO cells stably expr...
Ligand InfoPC cidPC sid
In DepthDetails US Patent