BDBM47391 3-(quinoxaline-2-carbonylamino)benzoic acid ethyl ester::3-[[oxo(2-quinoxalinyl)methyl]amino]benzoic acid ethyl ester::UNM000011099101::cid_3239096::ethyl 3-(quinoxalin-2-ylcarbonylamino)benzoate::ethyl 3-(quinoxaline-2-carbonylamino)benzoate
SMILES CCOC(=O)c1cccc(NC(=O)c2cnc3ccccc3n2)c1
InChI Key InChIKey=MBQCDYMTQRDDJC-UHFFFAOYSA-N
Data  1 EC50
  Tab Delimited (TSV)   2D SDfile   Computed 3D by Vconf -m prep SDfile
Find this compound or compounds like it in BindingDB:
Activity Spreadsheet -- Enzyme Inhibition Constant Data from BindingDB
Found 1 hit for monomerid = 47391
LigandPNGBDBM47391(3-(quinoxaline-2-carbonylamino)benzoic acid ethyl ...)
Affinity DataEC50:  1.18E+4nM. Assay description: University of New Mexico Assay Overview: Assay Support:1R03MH081228-01A1 High-throughput multiplex screening for ABC transporter inhibitors PI: Rich...
In DepthDetails PCBioAssay