BDBM476319 US10874683, Example EIDD-02423-01
SMILES CN(C)C(=O)ONc1ccn([C@@H]2O[C@H](CO)[C@H](O)C2O)c(=O)n1
InChI Key InChIKey=CDTBGVFKNKXFMJ-UKUJCULDSA-N
Data  1 EC50
  Tab Delimited (TSV)   2D SDfile   Computed 3D by Vconf -m prep SDfile
Find this compound or compounds like it in BindingDB:
Activity Spreadsheet -- Enzyme Inhibition Constant Data from BindingDB
Found 1 hit for monomerid = 476319
TargetStructural polyprotein(CHIKV)
Emory University
US Patent
LigandPNGBDBM476319(US10874683, Example EIDD-02423-01)
Affinity DataEC50:  2.50E+4nM. Assay description: Primary cytopathic effect (CPE) reduction assay. Four-concentration CPE inhibition assays are performed. Confluent or near-confluent cell culture mon...
Ligand InfoPC cidPC sid
In DepthDetails US Patent