BDBM476330 US10874683, Example EIDD-02108-03
SMILES CCCCCCCCCCCCCCCCOCCCOP(O)(=O)OC[C@H]1O[C@H](C(O)[C@H]1O)n1ccc(NO)nc1=O
InChI Key InChIKey=SBFDRBUGMZLDPS-GZOJFTLESA-N
Data  1 EC50
  Tab Delimited (TSV)   2D SDfile   Computed 3D by Vconf -m prep SDfile
Find this compound or compounds like it in BindingDB:
Activity Spreadsheet -- Enzyme Inhibition Constant Data from BindingDB
Found 1 hit for monomerid = 476330
TargetStructural polyprotein(CHIKV)
Emory University
US Patent
LigandPNGBDBM476330(US10874683, Example EIDD-02108-03)
Affinity DataEC50:  3.45E+4nM. Assay description: Primary cytopathic effect (CPE) reduction assay. Four-concentration CPE inhibition assays are performed. Confluent or near-confluent cell culture mon...
Ligand InfoPC cidPC sid
In DepthDetails US Patent