BDBM476573 US10869929, Compound 7::US11554172, Compound 7
SMILES CCC(=O)O[C@@]1([C@H](C)C[C@H]2[C@@H]3C[C@H](F)C4=CC(=O)C=C[C@]4(C)[C@@]3(F)[C@@H](O)C[C@]12C)C(=O)SCCCCCCP(O)(O)=O
InChI Key InChIKey=VYMKIBYWMBCPEZ-PLVREPCMSA-N
Data  2 IC50
  Tab Delimited (TSV)   2D SDfile   Computed 3D by Vconf -m prep SDfile
Find this compound or compounds like it in BindingDB:
Activity Spreadsheet -- Enzyme Inhibition Constant Data from BindingDB
Found 2 hits for monomerid = 476573
TargetGlucocorticoid receptor(Homo sapiens (Human))
Merck Sharp & Dohme
US Patent
LigandPNGBDBM476573(US10869929, Compound 7 | US11554172, Compound 7)
Affinity DataIC50:  0.450nM. Assay description: The potency of binding to gucocorticoid receptor by small molecule compounds was measured with the PolarScreen™ Glucocorticoid Receptor Competitor As...
Ligand InfoPC cidPC sid
In DepthDetails US Patent
TargetTSC22 domain family protein 3(Human)
Merck Sharp & Dohme
US Patent
LigandPNGBDBM476573(US10869929, Compound 7 | US11554172, Compound 7)
Affinity DataIC50:  0.450nM. Assay description: HUT78 cells were cultured in IMEM plus 20% heat inactivated FBS and cell density was maintained between 0.1 to 1.2 million/mL. 786-O cells were cultu...
Ligand InfoPC cidPC sid
In DepthDetails US Patent