BDBM476936 SARS-CoV-2 3CLpro Inhibitors 2e
SMILES CC(C)C[C@H](NC(=O)OCC1CC2CC1C=C2)C(=O)NC(CC1CCNC1=O)C=O
InChI Key InChIKey=RPHGJUFZINUIBX-LUWCXRDKSA-N
Data  1 IC50
  Tab Delimited (TSV)   2D SDfile   Computed 3D by Vconf -m prep SDfile
Find this compound or compounds like it in BindingDB:
Activity Spreadsheet -- Enzyme Inhibition Constant Data from BindingDB
Found 1 hit for monomerid = 476936
TargetReplicase polyprotein 1ab(2019-nCoV)
Wichita State University
LigandPNGBDBM476936(SARS-CoV-2 3CLpro Inhibitors 2e)
Affinity DataIC50:  260nM. Assay description: Cloning and Expression of the 3CL Protease of SARS-CoV-2 and FRET Enzyme Assays. The codon-optimized cDNA of full length of 3CLpro of SARS-CoV-2 (Gen...
Ligand InfoPC cidPC sid
In DepthDetails ArticlePubMed