BDBM476992 Inhibitor 12 of SARS-CoV-2 Mpro
SMILES Clc1sccc1COc1cc(Cl)cc(c1)-c1cc(cn(-c2cccnc2)c1=O)-c1c[nH]c(=O)[nH]c1=O
InChI Key InChIKey=GNSONAJPJOULHV-UHFFFAOYSA-N
Data  1 IC50
  Tab Delimited (TSV)   2D SDfile   Computed 3D by Vconf -m prep SDfile
Find this compound or compounds like it in BindingDB:
Activity Spreadsheet -- Enzyme Inhibition Constant Data from BindingDB
Found 1 hit for monomerid = 476992
TargetReplicase polyprotein 1ab(2019-nCoV)
Yale University
LigandPNGBDBM476992(Inhibitor 12 of SARS-CoV-2 Mpro)
Affinity DataIC50:  27nM. Assay description: Purified protein is diluted in reaction buffer to 100 nM in an opaque 96-well plate. The protein is incubated with or without compound in DMSO at dif...
Ligand InfoPC cidPC sid
In DepthDetails ArticlePubMed