BDBM477392 US10870641, Example 578A::US11014913, Example 578A
SMILES C[C@@H](COCCC(=O)N1CCN(CC1)c1ncc(cn1)C(F)(F)F)Oc1cn[nH]c(=O)c1Cl
InChI Key
Data  2 IC50
  Tab Delimited (TSV)   2D SDfile   Computed 3D by Vconf -m prep SDfile
Find this compound or compounds like it in BindingDB:
Activity Spreadsheet -- Enzyme Inhibition Constant Data from BindingDB
Found 2 hits for monomerid = 477392
TargetProtein mono-ADP-ribosyltransferase TIPARP(Human)
Ribon Therapeutics
US Patent
LigandPNGBDBM477392(US10870641, Example 578A | US11014913, Example 578...)
Affinity DataIC50: <100nM. Assay description: Displacement of Probe A, a biotinylated probe binding to the TIPARP active site, was measured using a time-resolved fluorescence energy transfer (TR-...
Ligand InfoPC cidPC sid
In DepthDetails US Patent
TargetProtein mono-ADP-ribosyltransferase TIPARP(Human)
Ribon Therapeutics
US Patent
LigandPNGBDBM477392(US10870641, Example 578A | US11014913, Example 578...)
Affinity DataIC50: <100nM. Assay description: Displacement of Probe A, a biotinylated probe binding to the TIPARP active site, was measured using a time-resolved fluorescence energy transfer (TR-...
Ligand InfoPC cidPC sid
In DepthDetails US Patent