BDBM479367 US10894803, M6C-Ethyl-NH2
SMILES NCCO[C@H]1OC(CCC(O)=O)[C@@H](O)[C@H](O)C1O
InChI Key InChIKey=IRNXMJVIGOWSEO-NTGVQHGMSA-N
Data  1 IC50
  Tab Delimited (TSV)   2D SDfile   Computed 3D by Vconf -m prep SDfile
Find this compound or compounds like it in BindingDB:
Activity Spreadsheet -- Enzyme Inhibition Constant Data from BindingDB
Found 1 hit for monomerid = 479367
TargetCation-independent mannose-6-phosphate receptor(Homo sapiens (Human))
Nanomedsyn
US Patent
LigandPNGBDBM479367(US10894803, M6C-Ethyl-NH2)
Affinity DataIC50:  9.90E+4nM. Assay description: 96-Well plates (Maxisorp Nunc) are incubated overnight at 4° C. with 200 μl of PMP (pentamannose 6-phosphate) at the concentration of 200 μ...
Ligand InfoPC cidPC sid
In DepthDetails US Patent