BDBM479486 ML300-based SC inhibitor 25
SMILES O=C(Cn1nnc2ccccc12)N(CC1CCCC1)c1ccc(cc1)-c1cccnc1
InChI Key InChIKey=MUXXBMHXURKPHX-UHFFFAOYSA-N
Data  2 IC50
  Tab Delimited (TSV)   2D SDfile   Computed 3D by Vconf -m prep SDfile
Find this compound or compounds like it in BindingDB:
Activity Spreadsheet -- Enzyme Inhibition Constant Data from BindingDB
Found 2 hits for monomerid = 479486
TargetReplicase polyprotein 1ab(2019-nCoV)
Cleveland Clinic
LigandPNGBDBM479486(ML300-based SC inhibitor 25)
Affinity DataIC50:  1.16E+3nM. Assay description: The protease activity and subsequent 10-point IC50 curves were spectroscopically determined using a scaled down, end point assay adapted from a previ...
Ligand InfoPC cidPC sid
In DepthDetails ArticlePubMed
TargetReplicase polyprotein 1ab(Human SARS coronavirus (SARS-CoV) (Severe acute re...)
Cleveland Clinic
LigandPNGBDBM479486(ML300-based SC inhibitor 25)
Affinity DataIC50:  1.00E+3nM. Assay description: The protease activity and subsequent 10-point IC50 curves were spectroscopically determined using a scaled down, end point assay adapted from a previ...
Ligand InfoPC cidPC sid
In DepthDetails ArticlePubMed