BDBM479490 ML300-based SC inhibitor 29
SMILES Fc1ccc(CN(C(=O)Cn2nnc3ccccc23)c2ccc(cc2)-c2cccnc2)cc1Cl
InChI Key InChIKey=LBNKWIIALDNORK-UHFFFAOYSA-N
Data  2 IC50
  Tab Delimited (TSV)   2D SDfile   Computed 3D by Vconf -m prep SDfile
Find this compound or compounds like it in BindingDB:
Activity Spreadsheet -- Enzyme Inhibition Constant Data from BindingDB
Found 2 hits for monomerid = 479490
TargetReplicase polyprotein 1ab(2019-nCoV)
Cleveland Clinic
LigandPNGBDBM479490(ML300-based SC inhibitor 29)
Affinity DataIC50:  8.53E+3nM. Assay description: The protease activity and subsequent 10-point IC50 curves were spectroscopically determined using a scaled down, end point assay adapted from a previ...
Ligand InfoPC cidPC sid
In DepthDetails ArticlePubMed
TargetReplicase polyprotein 1ab(Human SARS coronavirus (SARS-CoV) (Severe acute re...)
Cleveland Clinic
LigandPNGBDBM479490(ML300-based SC inhibitor 29)
Affinity DataIC50:  4.87E+3nM. Assay description: The protease activity and subsequent 10-point IC50 curves were spectroscopically determined using a scaled down, end point assay adapted from a previ...
Ligand InfoPC cidPC sid
In DepthDetails ArticlePubMed